Welcome to the Treehouse Community

The Treehouse Community is a meeting place for developers, designers, and programmers of all backgrounds and skill levels to get support. Collaborate here on code errors or bugs that you need feedback on, or asking for an extra set of eyes on your latest project. Join thousands of Treehouse students and alumni in the community today. (Note: Only Treehouse students can comment or ask questions, but non-students are welcome to browse our conversations.)

Looking to learn something new?

Treehouse offers a seven day free trial for new students. Get access to thousands of hours of content and a supportive community. Start your free trial today.

JavaScript Building a MEAN Application Introduction to the MEAN Stack Building a MEAN App Overview

Luca Spezzano
Luca Spezzano
10,417 Points

Issue after running yo meanjs

some help? i get this error: yo meanjs You're using the official MEAN.JS generator. ? What mean.js version would you like to generate? 0.4.0 0.4.0 ? In which folder would you like the project to be generated? This can be change d later. mean Cloning the MEAN repo....... ? What would you like to call your application? MEAN ? How would you describe your application? Full-Stack JavaScript with MongoDB, E xpress, AngularJS, and Node.js ? How would you describe your application in comma seperated key words? MongoDB, Express, AngularJS, Node.js ? What is your company/author name? ? Would you like to generate the article example CRUD module? Yes ? Would you like to generate the chat example module? Yes Running npm install for you.... This may take a couple minutes. Error: Command failed: cd mean && npm install npm WARN deprecated phantomjs@2.1.7: Package renamed to phantomjs-prebuilt. Please update 'phantomjs' package references to 'phantomjs-prebuilt' npm WARN deprecated graceful-fs@1.2.3: graceful-fs v3.0.0 and before will fail on node releases >= v7.0. Please update to graceful-fs@^4.0.0 as soon as possible. Use 'npm ls graceful-fs' to find it in the tree. npm WARN deprecated jade@0.26.3: Jade has been renamed to pug, please install the latest version of pug instead of jade npm WARN deprecated graceful-fs@2.0.3: graceful-fs v3.0.0 and before will fail on node releases >= v7.0. Please update to graceful-fs@^4.0.0 as soon as possible. Use 'npm ls graceful-fs' to find it in the tree. npm WARN deprecated lodash@1.0.2: lodash@<3.0.0 is no longer maintained. Upgrade to lodash@^4.0.0. npm WARN deprecated graceful-fs@3.0.8: graceful-fs v3.0.0 and before will fail on node releases >= v7.0. Please update to graceful-fs@^4.0.0 as soon as possible. Use 'npm ls graceful-fs' to find it in the tree. npm WARN deprecated cross-spawn-async@2.2.4: cross-spawn no longer requires a build toolchain, use it instead! npm WARN deprecated lodash@0.9.2: Grunt needs your help! See https://github.com/gruntjs/grunt/issues/1403. npm WARN prefer global jshint@2.8.0 should be installed with -g npm WARN prefer global node-gyp@3.3.1 should be installed with -g npm WARN prefer global node-inspector@0.10.2 should be installed with -g In file included from ../src/bufferutil.cc:16: ../../nan/nan.h:261:25: error: redefinition of '_NanEnsureLocal' NAN_INLINE v8::Local<T> _NanEnsureLocal(v8::Local<T> val) { ^ ../../nan/nan.h:256:25: note: previous definition is here NAN_INLINE v8::Local<T> _NanEnsureLocal(v8::Handle<T> val) { ^ ../../nan/nan.h:661:13: error: no member named 'smalloc' in namespace 'node' , node::smalloc::FreeCallback callback ~~~~^ ../../nan/nan.h:672:12: error: no matching function for call to 'New' return node::Buffer::New(v8::Isolate::GetCurrent(), data, size); ^~~~~~~~~~~~~~~ /Users/macluca/.node-gyp/5.7.0/include/node/node_buffer.h:31:40: note: candidate function not viable: no known conversion from 'uint32_t' (aka 'unsigned int') to 'enum encoding' for 3rd argument NODE_EXTERN v8::MaybeLocal<v8::Object> New(v8::Isolate* isolate, ^ /Users/macluca/.node-gyp/5.7.0/include/node/node_buffer.h:43:40: note: candidate function not viable: 2nd argument ('const char ') would lose const qualifier NODE_EXTERN v8::MaybeLocal<v8::Object> New(v8::Isolate isolate, ^ /Users/macluca/.node-gyp/5.7.0/include/node/node_buffer.h:28:40: note: candidate function not viable: requires 2 arguments, but 3 were provided NODE_EXTERN v8::MaybeLocal<v8::Object> New(v8::Isolate* isolate, size_t length); ^ /Users/macluca/.node-gyp/5.7.0/include/node/node_buffer.h:36:40: note: candidate function not viable: requires 5 arguments, but 3 were provided NODE_EXTERN v8::MaybeLocal<v8::Object> New(v8::Isolate* isolate, ^ In file included from ../src/bufferutil.cc:16: ../../nan/nan.h:676:12: error: no viable conversion from 'v8::MaybeLocal<v8::Object>' to 'v8::Local<v8::Object>' return node::Buffer::New(v8::Isolate::GetCurrent(), size); ^~~~~~~~~~~~~~~~~~~~~~~~~~~~~~~~~~~~~~~~~~~~~~~~~~ /Users/macluca/.node-gyp/5.7.0/include/node/v8.h:210:7: note: candidate constructor (the implicit copy constructor) not viable: no known conversion from 'v8::MaybeLocal<v8::Object>' to 'const v8::Local<v8::Object> &' for 1st argument class Local { ^ /Users/macluca/.node-gyp/5.7.0/include/node/v8.h:210:7: note: candidate constructor (the implicit move constructor) not viable: no known conversion from 'v8::MaybeLocal<v8::Object>' to 'v8::Local<v8::Object> &&' for 1st argument class Local { ^ /Users/macluca/.node-gyp/5.7.0/include/node/v8.h:214:13: note: candidate template ignored: could not match 'Local' against 'MaybeLocal' V8_INLINE Local(Local<S> that) ^ /Users/macluca/.node-gyp/5.7.0/include/node/v8.h:326:13: note: candidate template ignored: could not match 'S ' against 'v8::MaybeLocal<v8::Object>' V8_INLINE Local(S that) ^ In file included from ../src/bufferutil.cc:16: ../../nan/nan.h:683:26: error: no member named 'Use' in namespace 'node::Buffer' return node::Buffer::Use(v8::Isolate::GetCurrent(), data, size); ~~~~~~~~~~~~^ In file included from ../src/bufferutil.cc:7: /Users/macluca/.node-gyp/5.7.0/include/node/v8.h:221:5: error: assigning to 'v8::Primitive *volatile' from incompatible type 'v8::Value *' TYPE_CHECK(T, S); ^~~~~~~~~~~~~~ /Users/macluca/.node-gyp/5.7.0/include/node/v8.h:180:37: note: expanded from macro 'TYPE_CHECK' (static_cast<T volatile*>(0)) = static_cast<S*>(0); \ ^ ~~~~~~~~~~~~~~~~~~ ../../nan/nan.h:414:12: note: in instantiation of function template specialization 'v8::Local<v8::Primitive>::Local<v8::Value>' requested here return NanEscapeScope(NanNew(v8::Undefined(v8::Isolate::GetCurrent()))); ^ ../../nan/nan.h:398:30: note: expanded from macro 'NanEscapeScope'

define NanEscapeScope(val) scope.Escape(_NanEnsureLocal(val))

                         ^

In file included from ../src/bufferutil.cc:7: /Users/macluca/.node-gyp/5.7.0/include/node/v8.h:221:5: error: assigning to 'v8::Boolean volatile' from incompatible type 'v8::Value *' TYPE_CHECK(T, S); ^~~~~~~~~~~~~~~~ /Users/macluca/.node-gyp/5.7.0/include/node/v8.h:180:37: note: expanded from macro 'TYPE_CHECK' *(static_cast<T volatile*>(0)) = static_cast<S*>(0); \ ^ ~~~~~~~~~~~~~~~~~~ ../../nan/nan.h:424:12: note: in instantiation of function template specialization 'v8::Local<v8::Boolean>::Local<v8::Value>' requested here return NanEscapeScope(NanNew(v8::True(v8::Isolate::GetCurrent()))); ^ ../../nan/nan.h:398:30: note: expanded from macro 'NanEscapeScope'

define NanEscapeScope(val) scope.Escape(_NanEnsureLocal(val))

                         ^

In file included from ../src/bufferutil.cc:7: /Users/macluca/.node-gyp/5.7.0/include/node/v8.h:221:5: error: assigning to 'v8::Function volatile' from incompatible type 'v8::Value *' TYPE_CHECK(T, S); ^~~~~~~~~~~~~~~~ /Users/macluca/.node-gyp/5.7.0/include/node/v8.h:180:37: note: expanded from macro 'TYPE_CHECK' *(static_cast<T volatile*>(0)) = static_cast<S*>(0); \ ^ ~~~~~~~~~~~~~~~~~~ ../../nan/nan.h:1514:12: note: in instantiation of function template specialization 'v8::Local<v8::Function>::Local<v8::Value>' requested here return NanEscapeScope(NanNew(handle)->Get(kCallbackIndex) ^ ../../nan/nan.h:398:30: note: expanded from macro 'NanEscapeScope'

define NanEscapeScope(val) scope.Escape(_NanEnsureLocal(val))

                         ^

In file included from ../src/bufferutil.cc:7: /Users/macluca/.node-gyp/5.7.0/include/node/v8.h:221:5: error: assigning to 'v8::Object volatile' from incompatible type 'v8::Value *' TYPE_CHECK(T, S); ^~~~~~~~~~~~~~~~ /Users/macluca/.node-gyp/5.7.0/include/node/v8.h:180:37: note: expanded from macro 'TYPE_CHECK' *(static_cast<T volatile*>(0)) = static_cast<S*>(0); \ ^ ~~~~~~~~~~~~~~~~~~ ../../nan/nan.h:1632:12: note: in instantiation of function template specialization 'v8::Local<v8::Object>::Local<v8::Value>' requested here return NanEscapeScope(handle->Get(NanNew(key)).As<v8::Object>()); ^ ../../nan/nan.h:398:30: note: expanded from macro 'NanEscapeScope'

define NanEscapeScope(val) scope.Escape(_NanEnsureLocal(val))

                         ^

9 errors generated. make: *** [Release/obj.target/bufferutil/src/bufferutil.o] Error 1 gyp ERR! build error gyp ERR! stack Error: make failed with exit code: 2 gyp ERR! stack at ChildProcess.onExit (/usr/local/lib/node_modules/npm/node_modules/node-gyp/lib/build.js:276:23) gyp ERR! stack at emitTwo (events.js:100:13) gyp ERR! stack at ChildProcess.emit (events.js:185:7) gyp ERR! stack at Process.ChildProcess._handle.onexit (internal/child_process.js:200:12) gyp ERR! System Darwin 14.5.0 gyp ERR! command "/usr/local/Cellar/node/5.7.0/bin/node" "/usr/local/lib/node_modules/npm/node_modules/node-gyp/bin/node-gyp.js" "rebuild" gyp ERR! cwd /Users/macluca/Desktop/mean/node_modules/bufferutil gyp ERR! node -v v5.7.0 gyp ERR! node-gyp -v v3.2.1 gyp ERR! not ok npm WARN install:bufferutil@1.1.0 bufferutil@1.1.0 install: node-gyp rebuild npm WARN install:bufferutil@1.1.0 Exit status 1 ./Release/.deps/Release/obj.target/bufferutil/src/bufferutil.o.d.raw { dev: 16777220, mode: 33188, nlink: 1, uid: 501, gid: 20, rdev: 0, blksize: 4096, ino: 15067019, size: 1210, blocks: 8, atime: Thu May 19 2016 23:23:01 GMT+0200 (CEST), mtime: Thu May 19 2016 23:23:01 GMT+0200 (CEST), ctime: Thu May 19 2016 23:23:01 GMT+0200 (CEST), birthtime: Thu May 19 2016 23:23:01 GMT+0200 (CEST) } ./Release/.deps/Release/obj.target/validation/src/validation.o.d.raw { dev: 16777220, mode: 33188, nlink: 1, uid: 501, gid: 20, rdev: 0, blksize: 4096, ino: 15067039, size: 1210, blocks: 8, atime: Thu May 19 2016 23:23:03 GMT+0200 (CEST), mtime: Thu May 19 2016 23:23:03 GMT+0200 (CEST), ctime: Thu May 19 2016 23:23:03 GMT+0200 (CEST), birthtime: Thu May 19 2016 23:23:02 GMT+0200 (CEST) } In file included from ../src/validation.cc:15: ../../nan/nan.h:261:25: error: redefinition of '_NanEnsureLocal' NAN_INLINE v8::Local<T> _NanEnsureLocal(v8::Local<T> val) { ^ ../../nan/nan.h:256:25: note: previous definition is here NAN_INLINE v8::Local<T> _NanEnsureLocal(v8::Handle<T> val) { ^ ../../nan/nan.h:661:13: error: no member named 'smalloc' in namespace 'node' , node::smalloc::FreeCallback callback ~~~~^ ../../nan/nan.h:672:12: error: no matching function for call to 'New' return node::Buffer::New(v8::Isolate::GetCurrent(), data, size); ^~~~~~~~~~~~~~~ /Users/macluca/.node-gyp/5.7.0/include/node/node_buffer.h:31:40: note: candidate function not viable: no known conversion from 'uint32_t' (aka 'unsigned int') to 'enum encoding' for 3rd argument NODE_EXTERN v8::MaybeLocal<v8::Object> New(v8::Isolate* isolate, ^ /Users/macluca/.node-gyp/5.7.0/include/node/node_buffer.h:43:40: note: candidate function not viable: 2nd argument ('const char ') would lose const qualifier NODE_EXTERN v8::MaybeLocal<v8::Object> New(v8::Isolate isolate, ^ /Users/macluca/.node-gyp/5.7.0/include/node/node_buffer.h:28:40: note: candidate function not viable: requires 2 arguments, but 3 were provided NODE_EXTERN v8::MaybeLocal<v8::Object> New(v8::Isolate* isolate, size_t length); ^ /Users/macluca/.node-gyp/5.7.0/include/node/node_buffer.h:36:40: note: candidate function not viable: requires 5 arguments, but 3 were provided NODE_EXTERN v8::MaybeLocal<v8::Object> New(v8::Isolate* isolate, ^ In file included from ../src/validation.cc:15: ../../nan/nan.h:676:12: error: no viable conversion from 'v8::MaybeLocal<v8::Object>' to 'v8::Local<v8::Object>' return node::Buffer::New(v8::Isolate::GetCurrent(), size); ^~~~~~~~~~~~~~~~~~~~~~~~~~~~~~~~~~~~~~~~~~~~~~~~~~ /Users/macluca/.node-gyp/5.7.0/include/node/v8.h:210:7: note: candidate constructor (the implicit copy constructor) not viable: no known conversion from 'v8::MaybeLocal<v8::Object>' to 'const v8::Local<v8::Object> &' for 1st argument class Local { ^ /Users/macluca/.node-gyp/5.7.0/include/node/v8.h:210:7: note: candidate constructor (the implicit move constructor) not viable: no known conversion from 'v8::MaybeLocal<v8::Object>' to 'v8::Local<v8::Object> &&' for 1st argument class Local { ^ /Users/macluca/.node-gyp/5.7.0/include/node/v8.h:214:13: note: candidate template ignored: could not match 'Local' against 'MaybeLocal' V8_INLINE Local(Local<S> that) ^ /Users/macluca/.node-gyp/5.7.0/include/node/v8.h:326:13: note: candidate template ignored: could not match 'S ' against 'v8::MaybeLocal<v8::Object>' V8_INLINE Local(S that) ^ In file included from ../src/validation.cc:15: ../../nan/nan.h:683:26: error: no member named 'Use' in namespace 'node::Buffer' return node::Buffer::Use(v8::Isolate::GetCurrent(), data, size); ~~~~~~~~~~~~^ In file included from ../src/validation.cc:7: /Users/macluca/.node-gyp/5.7.0/include/node/v8.h:221:5: error: assigning to 'v8::Primitive *volatile' from incompatible type 'v8::Value *' TYPE_CHECK(T, S); ^~~~~~~~~~~~~~ /Users/macluca/.node-gyp/5.7.0/include/node/v8.h:180:37: note: expanded from macro 'TYPE_CHECK' (static_cast<T volatile*>(0)) = static_cast<S*>(0); \ ^ ~~~~~~~~~~~~~~~~~~ ../../nan/nan.h:414:12: note: in instantiation of function template specialization 'v8::Local<v8::Primitive>::Local<v8::Value>' requested here return NanEscapeScope(NanNew(v8::Undefined(v8::Isolate::GetCurrent()))); ^ ../../nan/nan.h:398:30: note: expanded from macro 'NanEscapeScope'

define NanEscapeScope(val) scope.Escape(_NanEnsureLocal(val))

                         ^

In file included from ../src/validation.cc:7: /Users/macluca/.node-gyp/5.7.0/include/node/v8.h:221:5: error: assigning to 'v8::Boolean volatile' from incompatible type 'v8::Value *' TYPE_CHECK(T, S); ^~~~~~~~~~~~~~~~ /Users/macluca/.node-gyp/5.7.0/include/node/v8.h:180:37: note: expanded from macro 'TYPE_CHECK' *(static_cast<T volatile*>(0)) = static_cast<S*>(0); \ ^ ~~~~~~~~~~~~~~~~~~ ../../nan/nan.h:424:12: note: in instantiation of function template specialization 'v8::Local<v8::Boolean>::Local<v8::Value>' requested here return NanEscapeScope(NanNew(v8::True(v8::Isolate::GetCurrent()))); ^ ../../nan/nan.h:398:30: note: expanded from macro 'NanEscapeScope'

define NanEscapeScope(val) scope.Escape(_NanEnsureLocal(val))

                         ^

In file included from ../src/validation.cc:7: /Users/macluca/.node-gyp/5.7.0/include/node/v8.h:221:5: error: assigning to 'v8::Function volatile' from incompatible type 'v8::Value *' TYPE_CHECK(T, S); ^~~~~~~~~~~~~~~~ /Users/macluca/.node-gyp/5.7.0/include/node/v8.h:180:37: note: expanded from macro 'TYPE_CHECK' *(static_cast<T volatile*>(0)) = static_cast<S*>(0); \ ^ ~~~~~~~~~~~~~~~~~~ ../../nan/nan.h:1514:12: note: in instantiation of function template specialization 'v8::Local<v8::Function>::Local<v8::Value>' requested here return NanEscapeScope(NanNew(handle)->Get(kCallbackIndex) ^ ../../nan/nan.h:398:30: note: expanded from macro 'NanEscapeScope'

define NanEscapeScope(val) scope.Escape(_NanEnsureLocal(val))

                         ^

In file included from ../src/validation.cc:7: /Users/macluca/.node-gyp/5.7.0/include/node/v8.h:221:5: error: assigning to 'v8::Object volatile' from incompatible type 'v8::Value *' TYPE_CHECK(T, S); ^~~~~~~~~~~~~~~~ /Users/macluca/.node-gyp/5.7.0/include/node/v8.h:180:37: note: expanded from macro 'TYPE_CHECK' *(static_cast<T volatile*>(0)) = static_cast<S*>(0); \ ^ ~~~~~~~~~~~~~~~~~~ ../../nan/nan.h:1632:12: note: in instantiation of function template specialization 'v8::Local<v8::Object>::Local<v8::Value>' requested here return NanEscapeScope(handle->Get(NanNew(key)).As<v8::Object>()); ^ ../../nan/nan.h:398:30: note: expanded from macro 'NanEscapeScope'

define NanEscapeScope(val) scope.Escape(_NanEnsureLocal(val))

                         ^

9 errors generated. make: *** [Release/obj.target/validation/src/validation.o] Error 1 gyp ERR! build error gyp ERR! stack Error: make failed with exit code: 2 gyp ERR! stack at ChildProcess.onExit (/usr/local/lib/node_modules/npm/node_modules/node-gyp/lib/build.js:276:23) gyp ERR! stack at emitTwo (events.js:100:13) gyp ERR! stack at ChildProcess.emit (events.js:185:7) gyp ERR! stack at Process.ChildProcess._handle.onexit (internal/child_process.js:200:12) gyp ERR! System Darwin 14.5.0 gyp ERR! command "/usr/local/Cellar/node/5.7.0/bin/node" "/usr/local/lib/node_modules/npm/node_modules/node-gyp/bin/node-gyp.js" "rebuild" gyp ERR! cwd /Users/macluca/Desktop/mean/node_modules/utf-8-validate gyp ERR! node -v v5.7.0 gyp ERR! node-gyp -v v3.2.1 gyp ERR! not ok npm WARN install:utf-8-validate@1.1.0 utf-8-validate@1.1.0 install: node-gyp rebuild npm WARN install:utf-8-validate@1.1.0 Exit status 1 node-pre-gyp ERR! Tried to download: https://node-inspector.s3.amazonaws.com/profiler/v5.2.12/node-v47-darwin-x64.tar.gz node-pre-gyp ERR! Pre-built binaries not found for v8-profiler@5.2.12 and node@5.7.0 (node-v47 ABI) (falling back to source compile with node-gyp) ./Release/.deps/Release/obj.target/profiler/src/profiler.o.d.raw { dev: 16777220, mode: 33188, nlink: 1, uid: 501, gid: 20, rdev: 0, blksize: 4096, ino: 15067127, size: 1409, blocks: 8, atime: Thu May 19 2016 23:23:12 GMT+0200 (CEST), mtime: Thu May 19 2016 23:23:12 GMT+0200 (CEST), ctime: Thu May 19 2016 23:23:12 GMT+0200 (CEST), birthtime: Thu May 19 2016 23:23:12 GMT+0200 (CEST) } ./Release/.deps/Release/obj.target/profiler/src/cpu_profiler.o.d.raw { dev: 16777220, mode: 33188, nlink: 1, uid: 501, gid: 20, rdev: 0, blksize: 4096, ino: 15067130, size: 1415, blocks: 8, atime: Thu May 19 2016 23:23:12 GMT+0200 (CEST), mtime: Thu May 19 2016 23:23:12 GMT+0200 (CEST), ctime: Thu May 19 2016 23:23:12 GMT+0200 (CEST), birthtime: Thu May 19 2016 23:23:12 GMT+0200 (CEST) } ./Release/.deps/Release/obj.target/profiler/src/cpu_profile.o.d.raw { dev: 16777220, mode: 33188, nlink: 1, uid: 501, gid: 20, rdev: 0, blksize: 4096, ino: 15067133, size: 1417, blocks: 8, atime: Thu May 19 2016 23:23:13 GMT+0200 (CEST), mtime: Thu May 19 2016 23:23:13 GMT+0200 (CEST), ctime: Thu May 19 2016 23:23:13 GMT+0200 (CEST), birthtime: Thu May 19 2016 23:23:13 GMT+0200 (CEST) } ./Release/.deps/Release/obj.target/profiler/src/cpu_profile_node.o.d.raw { dev: 16777220, mode: 33188, nlink: 1, uid: 501, gid: 20, rdev: 0, blksize: 4096, ino: 15067136, size: 1402, blocks: 8, atime: Thu May 19 2016 23:23:13 GMT+0200 (CEST), mtime: Thu May 19 2016 23:23:13 GMT+0200 (CEST), ctime: Thu May 19 2016 23:23:13 GMT+0200 (CEST), birthtime: Thu May 19 2016 23:23:13 GMT+0200 (CEST) } ./Release/.deps/Release/obj.target/profiler/src/heap_profiler.o.d.raw { dev: 16777220, mode: 33188, nlink: 1, uid: 501, gid: 20, rdev: 0, blksize: 4096, ino: 15067139, size: 1448, blocks: 8, atime: Thu May 19 2016 23:23:14 GMT+0200 (CEST), mtime: Thu May 19 2016 23:23:14 GMT+0200 (CEST), ctime: Thu May 19 2016 23:23:14 GMT+0200 (CEST), birthtime: Thu May 19 2016 23:23:14 GMT+0200 (CEST) } ./Release/.deps/Release/obj.target/profiler/src/heap_snapshot.o.d.raw { dev: 16777220, mode: 33188, nlink: 1, uid: 501, gid: 20, rdev: 0, blksize: 4096, ino: 15067142, size: 1450, blocks: 8, atime: Thu May 19 2016 23:23:14 GMT+0200 (CEST), mtime: Thu May 19 2016 23:23:14 GMT+0200 (CEST), ctime: Thu May 19 2016 23:23:14 GMT+0200 (CEST), birthtime: Thu May 19 2016 23:23:14 GMT+0200 (CEST) } ./Release/.deps/Release/obj.target/profiler/src/heap_output_stream.o.d.raw { dev: 16777220, mode: 33188, nlink: 1, uid: 501, gid: 20, rdev: 0, blksize: 4096, ino: 15067145, size: 1408, blocks: 8, atime: Thu May 19 2016 23:23:15 GMT+0200 (CEST), mtime: Thu May 19 2016 23:23:15 GMT+0200 (CEST), ctime: Thu May 19 2016 23:23:15 GMT+0200 (CEST), birthtime: Thu May 19 2016 23:23:15 GMT+0200 (CEST) } ./Release/.deps/Release/obj.target/profiler/src/heap_graph_node.o.d.raw { dev: 16777220, mode: 33188, nlink: 1, uid: 501, gid: 20, rdev: 0, blksize: 4096, ino: 15067148, size: 1428, blocks: 8, atime: Thu May 19 2016 23:23:15 GMT+0200 (CEST), mtime: Thu May 19 2016 23:23:15 GMT+0200 (CEST), ctime: Thu May 19 2016 23:23:15 GMT+0200 (CEST), birthtime: Thu May 19 2016 23:23:15 GMT+0200 (CEST) } ./Release/.deps/Release/obj.target/profiler/src/heap_graph_edge.o.d.raw { dev: 16777220, mode: 33188, nlink: 1, uid: 501, gid: 20, rdev: 0, blksize: 4096, ino: 15067154, size: 1428, blocks: 8, atime: Thu May 19 2016 23:23:16 GMT+0200 (CEST), mtime: Thu May 19 2016 23:23:16 GMT+0200 (CEST), ctime: Thu May 19 2016 23:23:16 GMT+0200 (CEST), birthtime: Thu May 19 2016 23:23:16 GMT+0200 (CEST) } Release/obj.target/action_after_build.stamp { dev: 16777220, mode: 33188, nlink: 1, uid: 501, gid: 20, rdev: 0, blksize: 4096, ino: 15067173, size: 0, blocks: 0, atime: Thu May 19 2016 23:23:16 GMT+0200 (CEST), mtime: Thu May 19 2016 23:23:16 GMT+0200 (CEST), ctime: Thu May 19 2016 23:23:16 GMT+0200 (CEST), birthtime: Thu May 19 2016 23:23:16 GMT+0200 (CEST) } node-pre-gyp ERR! Tried to download: https://node-inspector.s3.amazonaws.com/debug/v0.4.6/node-v47-darwin-x64.tar.gz node-pre-gyp ERR! Pre-built binaries not found for v8-debug@0.4.6 and node@5.7.0 (node-v47 ABI) (falling back to source compile with node-gyp) In file included from ../src/debug.cc:2: ../../nan/nan.h:261:25: error: redefinition of '_NanEnsureLocal' NAN_INLINE v8::Local<T> _NanEnsureLocal(v8::Local<T> val) { ^ ../../nan/nan.h:256:25: note: previous definition is here NAN_INLINE v8::Local<T> _NanEnsureLocal(v8::Handle<T> val) { ^ ../../nan/nan.h:661:13: error: no member named 'smalloc' in namespace 'node' , node::smalloc::FreeCallback callback ~~~~^ ../../nan/nan.h:672:12: error: no matching function for call to 'New' return node::Buffer::New(v8::Isolate::GetCurrent(), data, size); ^~~~~~~~~~~~~~~ /Users/macluca/.node-gyp/5.7.0/include/node/node_buffer.h:31:40: note: candidate function not viable: no known conversion from 'uint32_t' (aka 'unsigned int') to 'enum encoding' for 3rd argument NODE_EXTERN v8::MaybeLocal<v8::Object> New(v8::Isolate* isolate, ^ /Users/macluca/.node-gyp/5.7.0/include/node/node_buffer.h:43:40: note: candidate function not viable: 2nd argument ('const char ') would lose const qualifier NODE_EXTERN v8::MaybeLocal<v8::Object> New(v8::Isolate isolate, ^ /Users/macluca/.node-gyp/5.7.0/include/node/node_buffer.h:28:40: note: candidate function not viable: requires 2 arguments, but 3 were provided NODE_EXTERN v8::MaybeLocal<v8::Object> New(v8::Isolate* isolate, size_t length); ^ /Users/macluca/.node-gyp/5.7.0/include/node/node_buffer.h:36:40: note: candidate function not viable: requires 5 arguments, but 3 were provided NODE_EXTERN v8::MaybeLocal<v8::Object> New(v8::Isolate* isolate, ^ In file included from ../src/debug.cc:2: ../../nan/nan.h:676:12: error: no viable conversion from 'v8::MaybeLocal<v8::Object>' to 'v8::Local<v8::Object>' return node::Buffer::New(v8::Isolate::GetCurrent(), size); ^~~~~~~~~~~~~~~~~~~~~~~~~~~~~~~~~~~~~~~~~~~~~~~~~~ /Users/macluca/.node-gyp/5.7.0/include/node/v8.h:210:7: note: candidate constructor (the implicit copy constructor) not viable: no known conversion from 'v8::MaybeLocal<v8::Object>' to 'const v8::Local<v8::Object> &' for 1st argument class Local { ^ /Users/macluca/.node-gyp/5.7.0/include/node/v8.h:210:7: note: candidate constructor (the implicit move constructor) not viable: no known conversion from 'v8::MaybeLocal<v8::Object>' to 'v8::Local<v8::Object> &&' for 1st argument class Local { ^ /Users/macluca/.node-gyp/5.7.0/include/node/v8.h:214:13: note: candidate template ignored: could not match 'Local' against 'MaybeLocal' V8_INLINE Local(Local<S> that) ^ /Users/macluca/.node-gyp/5.7.0/include/node/v8.h:326:13: note: candidate template ignored: could not match 'S ' against 'v8::MaybeLocal<v8::Object>' V8_INLINE Local(S that) ^ In file included from ../src/debug.cc:2: ../../nan/nan.h:683:26: error: no member named 'Use' in namespace 'node::Buffer' return node::Buffer::Use(v8::Isolate::GetCurrent(), data, size); ~~~~~~~~~~~~^ ../src/debug.cc:194:25: warning: ISO C++11 does not allow conversion from string literal to 'char *' [-Wwritable-strings] result_type = ""; ^ In file included from ../src/debug.cc:2: In file included from ../../nan/nan.h:24: In file included from /Users/macluca/.node-gyp/5.7.0/include/node/node.h:42: /Users/macluca/.node-gyp/5.7.0/include/node/v8.h:221:5: error: assigning to 'v8::Primitive *volatile' from incompatible type 'v8::Value *' TYPE_CHECK(T, S); ^~~~~~~~~~~~~~ /Users/macluca/.node-gyp/5.7.0/include/node/v8.h:180:37: note: expanded from macro 'TYPE_CHECK' (static_cast<T volatile*>(0)) = static_cast<S*>(0); \ ^ ~~~~~~~~~~~~~~~~~~ ../../nan/nan.h:414:12: note: in instantiation of function template specialization 'v8::Local<v8::Primitive>::Local<v8::Value>' requested here return NanEscapeScope(NanNew(v8::Undefined(v8::Isolate::GetCurrent()))); ^ ../../nan/nan.h:398:30: note: expanded from macro 'NanEscapeScope'

define NanEscapeScope(val) scope.Escape(_NanEnsureLocal(val))

                         ^

In file included from ../src/debug.cc:2: In file included from ../../nan/nan.h:24: In file included from /Users/macluca/.node-gyp/5.7.0/include/node/node.h:42: /Users/macluca/.node-gyp/5.7.0/include/node/v8.h:221:5: error: assigning to 'v8::Boolean volatile' from incompatible type 'v8::Value *' TYPE_CHECK(T, S); ^~~~~~~~~~~~~~~~ /Users/macluca/.node-gyp/5.7.0/include/node/v8.h:180:37: note: expanded from macro 'TYPE_CHECK' *(static_cast<T volatile*>(0)) = static_cast<S*>(0); \ ^ ~~~~~~~~~~~~~~~~~~ ../../nan/nan.h:424:12: note: in instantiation of function template specialization 'v8::Local<v8::Boolean>::Local<v8::Value>' requested here return NanEscapeScope(NanNew(v8::True(v8::Isolate::GetCurrent()))); ^ ../../nan/nan.h:398:30: note: expanded from macro 'NanEscapeScope'

define NanEscapeScope(val) scope.Escape(_NanEnsureLocal(val))

                         ^

In file included from ../src/debug.cc:2: In file included from ../../nan/nan.h:24: In file included from /Users/macluca/.node-gyp/5.7.0/include/node/node.h:42: /Users/macluca/.node-gyp/5.7.0/include/node/v8.h:221:5: error: assigning to 'v8::Function volatile' from incompatible type 'v8::Value *' TYPE_CHECK(T, S); ^~~~~~~~~~~~~~~~ /Users/macluca/.node-gyp/5.7.0/include/node/v8.h:180:37: note: expanded from macro 'TYPE_CHECK' *(static_cast<T volatile*>(0)) = static_cast<S*>(0); \ ^ ~~~~~~~~~~~~~~~~~~ ../../nan/nan.h:1514:12: note: in instantiation of function template specialization 'v8::Local<v8::Function>::Local<v8::Value>' requested here return NanEscapeScope(NanNew(handle)->Get(kCallbackIndex) ^ ../../nan/nan.h:398:30: note: expanded from macro 'NanEscapeScope'

define NanEscapeScope(val) scope.Escape(_NanEnsureLocal(val))

                         ^

In file included from ../src/debug.cc:2: In file included from ../../nan/nan.h:24: In file included from /Users/macluca/.node-gyp/5.7.0/include/node/node.h:42: /Users/macluca/.node-gyp/5.7.0/include/node/v8.h:221:5: error: assigning to 'v8::Object volatile' from incompatible type 'v8::Value *' TYPE_CHECK(T, S); ^~~~~~~~~~~~~~~~ /Users/macluca/.node-gyp/5.7.0/include/node/v8.h:180:37: note: expanded from macro 'TYPE_CHECK' *(static_cast<T volatile*>(0)) = static_cast<S*>(0); \ ^ ~~~~~~~~~~~~~~~~~~ ../../nan/nan.h:1632:12: note: in instantiation of function template specialization 'v8::Local<v8::Object>::Local<v8::Value>' requested here return NanEscapeScope(handle->Get(NanNew(key)).As<v8::Object>()); ^ ../../nan/nan.h:398:30: note: expanded from macro 'NanEscapeScope'

define NanEscapeScope(val) scope.Escape(_NanEnsureLocal(val))

                         ^

In file included from ../src/debug.cc:2: In file included from ../../nan/nan.h:24: In file included from /Users/macluca/.node-gyp/5.7.0/include/node/node.h:42: /Users/macluca/.node-gyp/5.7.0/include/node/v8.h:221:5: error: assigning to 'v8::String volatile' from incompatible type 'v8::Value *' TYPE_CHECK(T, S); ^~~~~~~~~~~~~~~~ /Users/macluca/.node-gyp/5.7.0/include/node/v8.h:180:37: note: expanded from macro 'TYPE_CHECK' *(static_cast<T volatile*>(0)) = static_cast<S*>(0); \ ^ ~~~~~~~~~~~~~~~~~~ ../src/debug.cc:168:18: note: in instantiation of function template specialization 'v8::Local<v8::String>::Local<v8::Value>' requested here return NanEscapeScope(value->ToString()); ^ ../../nan/nan.h:398:30: note: expanded from macro 'NanEscapeScope'

define NanEscapeScope(val) scope.Escape(_NanEnsureLocal(val))

                         ^

1 warning and 10 errors generated. make: *** [Release/obj.target/debug/src/debug.o] Error 1 gyp ERR! build error gyp ERR! stack Error: make failed with exit code: 2 gyp ERR! stack at ChildProcess.onExit (/Users/macluca/Desktop/mean/node_modules/node-gyp/lib/build.js:276:23) gyp ERR! stack at emitTwo (events.js:100:13) gyp ERR! stack at ChildProcess.emit (events.js:185:7) gyp ERR! stack at Process.ChildProcess._handle.onexit (internal/child_process.js:200:12) gyp ERR! System Darwin 14.5.0 gyp ERR! command "/usr/local/Cellar/node/5.7.0/bin/node" "/Users/macluca/Desktop/mean/node_modules/node-gyp/bin/node-gyp.js" "build" "--fallback-to-build" "--module=/Users/macluca/Desktop/mean/node_modules/v8-debug/build/debug/v0.4.6/node-v47-darwin-x64/debug.node" "--module_name=debug" "--module_path=/Users/macluca/Desktop/mean/node_modules/v8-debug/build/debug/v0.4.6/node-v47-darwin-x64" gyp ERR! cwd /Users/macluca/Desktop/mean/node_modules/v8-debug gyp ERR! node -v v5.7.0 gyp ERR! node-gyp -v v3.3.1 gyp ERR! not ok node-pre-gyp ERR! build error node-pre-gyp ERR! stack Error: Failed to execute '/usr/local/Cellar/node/5.7.0/bin/node /Users/macluca/Desktop/mean/node_modules/node-gyp/bin/node-gyp.js build --fallback-to-build --module=/Users/macluca/Desktop/mean/node_modules/v8-debug/build/debug/v0.4.6/node-v47-darwin-x64/debug.node --module_name=debug --module_path=/Users/macluca/Desktop/mean/node_modules/v8-debug/build/debug/v0.4.6/node-v47-darwin-x64' (1) node-pre-gyp ERR! stack at ChildProcess.<anonymous> (/Users/macluca/Desktop/mean/node_modules/v8-debug/node_modules/node-pre-gyp/lib/util/compile.js:83:29) node-pre-gyp ERR! stack at emitTwo (events.js:100:13) node-pre-gyp ERR! stack at ChildProcess.emit (events.js:185:7) node-pre-gyp ERR! stack at maybeClose (internal/child_process.js:827:16) node-pre-gyp ERR! stack at Process.ChildProcess._handle.onexit (internal/child_process.js:211:5) node-pre-gyp ERR! System Darwin 14.5.0 node-pre-gyp ERR! command "/usr/local/Cellar/node/5.7.0/bin/node" "/Users/macluca/Desktop/mean/node_modules/v8-debug/node_modules/.bin/node-pre-gyp" "install" "--fallback-to-build" node-pre-gyp ERR! cwd /Users/macluca/Desktop/mean/node_modules/v8-debug node-pre-gyp ERR! node -v v5.7.0 node-pre-gyp ERR! node-pre-gyp -v v0.6.28 node-pre-gyp ERR! not ok npm WARN mongodb-core@1.2.31 requires a peer of kerberos@~0.0 but none was installed. npm ERR! Darwin 14.5.0 npm ERR! argv "/usr/local/Cellar/node/5.7.0/bin/node" "/usr/local/bin/npm" "install" npm ERR! node v5.7.0 npm ERR! npm v3.6.0 npm ERR! code ELIFECYCLE

npm ERR! v8-debug@0.4.6 install: node-pre-gyp install --fallback-to-build npm ERR! Exit status 1 npm ERR! npm ERR! Failed at the v8-debug@0.4.6 install script 'node-pre-gyp install --fallback-to-build'. npm ERR! Make sure you have the latest version of node.js and npm installed. npm ERR! If you do, this is most likely a problem with the v8-debug package, npm ERR! not with npm itself. npm ERR! Tell the author that this fails on your system: npm ERR! node-pre-gyp install --fallback-to-build npm ERR! You can get information on how to open an issue for this project with: npm ERR! npm bugs v8-debug npm ERR! Or if that isn't available, you can get their info via: npm ERR! npm owner ls v8-debug npm ERR! There is likely additional logging output above.

npm ERR! Please include the following file with any support request: npm ERR! /Users/macluca/Desktop/mean/npm-debug.log

at ChildProcess.exithandler (child_process.js:202:12)
at emitTwo (events.js:100:13)
at ChildProcess.emit (events.js:185:7)
at maybeClose (internal/child_process.js:827:16)
at Socket.<anonymous> (internal/child_process.js:319:11)
at emitOne (events.js:90:13)
at Socket.emit (events.js:182:7)
at Pipe._onclose (net.js:475:12)

1 Answer

Ken Howard
STAFF
Ken Howard
Treehouse Guest Teacher

Hi luca Spezzano

Unfortunately we can't provide support for the meanjs generator. However, this course doesn't depend on using the generator so you are safe to skip this portion of the course.

You can file an issue for the generator here: https://github.com/meanjs/mean/issues

I hope this helps.