Welcome to the Treehouse Community

The Treehouse Community is a meeting place for developers, designers, and programmers of all backgrounds and skill levels to get support. Collaborate here on code errors or bugs that you need feedback on, or asking for an extra set of eyes on your latest project. Join thousands of Treehouse students and alumni in the community today. (Note: Only Treehouse students can comment or ask questions, but non-students are welcome to browse our conversations.)

Looking to learn something new?

Treehouse offers a seven day free trial for new students. Get access to thousands of hours of content and a supportive community. Start your free trial today.

Python Introducing Tuples Getting to Know Tuples Creating Tuples

tuple

i completed the task as my_tuple='I','love','python'

can you explain where I went wrong?

Task #1

F

FAIL: test_code_expectations (main.TestCreateATuple)

Traceback (most recent call last): File "", line 22, in test_code_expectations AssertionError: Regex didn't match: 'my_tuple\s=\s[/(]?\\'?\"?I\"?\\'?,\s\\'?\"?love\"?\\'?,\s\\'?\"?python\"?\\'?[/)]?' not found in "# insert your code here\nmy_tuple='I','love','python.'" : To create a tuple, my_tuple should be equal to comma separated values. You can also use parentheses around the values if you want.


Ran 1 test in 0.001s

FAILED (failures=1)

create_tuple.py
# insert your code here
my_tuple='I','love','python.'

1 Answer

Jennifer Nordell
seal-mask
STAFF
.a{fill-rule:evenodd;}techdegree
Jennifer Nordell
Treehouse Teacher

Hi there, Jenn Giulietti! You're doing great. However, you put a period/full stop after "python" and the test isn't expecting that. So it doesn't match exactly. You may need to restart the challenge and then do it just like you did but without the "."

Hope this helps! :sparkles: