Welcome to the Treehouse Community

Want to collaborate on code errors? Have bugs you need feedback on? Looking for an extra set of eyes on your latest project? Get support with fellow developers, designers, and programmers of all backgrounds and skill levels here with the Treehouse Community! While you're at it, check out some resources Treehouse students have shared here.

Looking to learn something new?

Treehouse offers a seven day free trial for new students. Get access to thousands of hours of content and join thousands of Treehouse students and alumni in the community today.

Start your free trial

C# C# Basics (Retired) Perfect if / else if / else

Jushun Blackmon
Jushun Blackmon
3,136 Points

Error

StudentsCode.cs(13,20): error CS1525: Unexpected symbol 21' StudentsCode.cs(13,22): warning CS0642: Possible mistaken empty statement StudentsCode.cs(13,25): error CS1525: Unexpected symbol)', expecting ;' or}' StudentsCode.cs(17,0): error CS1525: Unexpected symbol `else' Compilation failed: 3 error(s), 1 warnings

I keep getting this error don't know where I'm going wrong.

1 Answer

Steven Parker
Steven Parker
229,005 Points

Show us the code you are entering that gets that error and we can probably help you identify the cause.